[tex-live] Mac OS X results

Gerben Wierda sherlock@rna.nl
Sun, 2 Jun 2002 12:47:31 +0200

I performed:

	p4 sync //depot/Build/source/...@2002/06/02:11:00:00
	a clean configure of the sources
	a make clean
	a make

This ends in failure:

srcdir=.  /bin/sh ./web2c/convert pdfetex
Cannot handle variable subrange in array decl: Last token = 290 ("), 
error buffer = `maxinopen',
         last id = `maxinopen' (variable).
./web2c/splitup: fatal: No #include pdfetexcoerce.h line.
./web2c/convert: conversion of pdfetex.p failed, moving dregs:
./web2c/convert:   mv pdfetex[0-9]*.c pdfetexini.c pdfetexd.h 
pdfetexcoerce.h /tmp
mv: rename pdfetex[0-9]*.c to /tmp/pdfetex[0-9]*.c: No such file or 
mv: rename pdfetexini.c to /tmp/pdfetexini.c: No such file or directory
make[4]: *** [pdfetexini.c] Error 1
make[3]: *** [all] Error 1
make[2]: *** [all] Error 1
make[1]: *** [all] Error 1
make: *** [compile-tex] Error 2