[tex-k] report some errors

Haifeng Wu wu.hfgeo at gmail.com
Wed Nov 9 09:22:46 CET 2011

When I was installing the texlive in Ubuntu 11.10, there are some
errors, I do not know how to solve it.

First run ./Build --debug, then losts of codes appeared, and then there
are some error. The following is the report:

1 of 46 tests failed
(1 test was not run)
Please report to tex-k at tug.org
make[5]: *** [check-TESTS] Error 1
make[5]: Leaving directory
make[4]: *** [check-am] Error 2
make[4]: Leaving directory
make[3]: *** [check-recursive] Error 1
make[3]: Leaving directory
make[2]: *** [check-recursive] Error 1
make[2]: Leaving directory
make[1]: *** [check-recursive] Error 1
make[1]: Leaving directory
make: *** [world] Error 2
Command exited with non-zero status 2
484.53user 143.49system 17:00.17elapsed 61%CPU (0avgtext+0avgdata
29072inputs+3610192outputs (42major+84580108minor)pagefaults 0swaps
+ echo 2

./Build: 333 executables in
done (exit status 2) Wed Nov 9 12:38:23 CST 2011

Thank you very much and hope for your reply.

Best regards, Haifeng Wu
-------------- next part --------------
An embedded and charset-unspecified text was scrubbed...
Name: errors
URL: <http://tug.org/pipermail/tex-k/attachments/20111109/0937aac2/attachment.ksh>

More information about the tex-k mailing list