[luatex] compiling error

luigi scarso luigi.scarso at gmail.com
Tue Mar 16 19:43:02 CET 2010

On Tue, Mar 16, 2010 at 6:23 PM, Taco Hoekwater <taco at elvenkind.com> wrote:
> Elie Roux wrote:
>> Hello,
>> trying to compile LuaTeX with latest svn version, I get from build.sh:
>> checking for icu-config... icu-config
>> checking requested system `graphite' library... ok
>> checking requested system `icu' library... ok
>> configure: error: you can not use system libraries for a native TeX Live
>> build
> Did you specify --make ? You need a clean rebuild this time,
> there are quite a lot of build system changes.
Error here too with 3512

make[1]: ingresso nella directory «/opt/luatex/svn/trunk/build/utils»
Making all in dummy
/bin/bash: line 17: cd: dummy: Nessun file o directory
make[1]: *** [all-recursive] Errore 1
make[1]: uscita dalla directory «/opt/luatex/svn/trunk/build/utils»
make: *** [all-recursive] Errore 1
strip: 'build/texk/web2c/luatex': No such file
ls: impossibile accedere a build/texk/web2c/luatex: Nessun file o directory


More information about the luatex mailing list